{"text_format":"1","workbook":"xlsx","n_sheets":7,"sheets":["Disclaimer","Scoring Grid","Rents & Affordability","Project Budget ","Proforma - Residential","Proforma - Non-Residential","Drawdown Schedule "],"not_rendered":{"charts":0,"images":2,"macros":1,"external_links":1,"defined_names":26,"comments":4,"pivot_tables":0},"unopened":[],"bounds":{"document_bytes":16777216,"sheet_cells":100000,"rows_first":2000,"rows_last":500,"rows_between":2000,"halvings":0,"cell_chars":16384,"cell_head_chars":4096},"cells_cut":0,"cells_raw":0,"read":"whole","date_system":"1900"}

{"sheet":"Disclaimer","index":0,"n_rows":17,"n_cols":10,"rows_kept":17,"cut":false,"hidden":false,"merged":[[4,1,15,10],[16,1,19,10]]}
[]
[null,null,null,null,null,null,null,null,"File Type","Repair and Renewal"]
[null,null,null,null,null,null,null,null,"Version ","2020-10-23"]
[]
[null,"Legal Disclaimer and Notice  - This Assessment Tool provided by CMHC is for general illustrative and estimation purposes only. The amounts it projects are based upon the information provided and the assumptions and estimates made by the model.  CMHC does not guarantee these projections. They are not intended to provide financial or other advice on particular housing projects and they should not be relied upon in that regard.  Neither CMHC nor any of its employees or advisors shall have any liability for the accuracy of the projections contained in the tool or for any damage caused by the use of the information.   The use of this Assessment Tool and its results with regard to any housing project do not oblige CMHC to insure the project financing nor provide funding for the housing project under this initiative or under any other CMHC program or initiative.  You are encouraged to contact your local CMHC Affordable Housing Consultant for assistance with this tool."]
[]
[]
[]
[]
[]
[]
[]
[]
[]
[]
[]
[null,"This Assessment Tool is protected by copyright and is subject to the protection of intellectual property laws. Users are authorized to download the Assessment Tool for its use in relation to the National Housing Co-Investment Fund only and may not further copy, reproduce, modify or distribute the Assessment Tool without the prior written consent of CMHC."]

{"sheet":"Scoring Grid","index":1,"n_rows":152,"n_cols":12,"rows_kept":152,"cut":false,"hidden":false,"merged":[[71,1,71,4],[1,0,1,13],[2,1,2,11],[2,13,112,13],[5,1,5,4],[12,1,12,4],[20,1,20,4],[27,1,27,4],[34,1,34,4],[43,1,43,4],[47,1,47,4],[51,1,51,4],[55,1,55,4],[59,1,59,4],[63,1,63,4],[67,1,67,4],[149,3,151,3],[75,1,75,4],[79,1,79,4],[84,1,84,4],[91,1,91,4],[97,1,97,4],[98,1,98,8],[101,1,101,11],[109,1,110,12],[124,3,124,6],[130,3,130,6],[136,3,136,6]]}
["Note: Only YELLOW hi-lighted fields that are applicable need to be input. "]
["NHCF Prioritization Scoring: Repair and Renewal"]
[null,"Please select the appropriate result for each criteria from the drop-down menu under \"Answer\". The combined score from all the categories will be used to determine the maximum primary funding.  The scores from the affodability, accessibility and environmental efficiency categories below will be used in determining the maximum eligibility for forgivable loan, for higher performance.  "]
[null,null,null,null,null,"Weight","Maximum Points Available",null,"Answer","Score","Weighted Score","Percentage Score"]
[null,"Affordability",null,null,null,30,{"$f":"SUM(G6,G13)","v":10},null,null,{"$f":"SUM(J6,J13)","v":0},{"$f":"SUM(K6,K13)","v":0},{"$f":"(K6+K13)/((F6*G6)+(F13*G13))","v":0}]
[null,"What percentage of units are at rental costs less than 80% of median market rent?",null,null,null,15,5,"¢",null,{"$f":"IF(I6=C7,G7,IF(I6=C8,G8,IF(I6=C9,G9,IF(I6=C10,G10,IF(I6=C11,G11,IF(I6=C12,G12,))))))","v":0},{"$f":"J6*F6","v":0}]
[null,null,"1.     30% of units are at rental cost of less than 80% of Median Market Rent ",null,null,null,0]
[null,null,"2.     31% to 40% of units at rental cost of less than 80% of Median Market Rent ",null,null,null,1]
[null,null,"3.     41% to 45% of units at rental cost of less than 80% of Median Market Rent ",null,null,null,2]
[null,null,"4.     46% to 50% of units at rental cost of less than 80% of Median Market Rent ",null,null,null,3]
[null,null,"5.     Above 50% of units at rental cost of less than 80% of Median Market Rent ",null,null,null,5]
[]
[null,"For units that are designated as affordable, what is the average rental amount?",null,null,null,15,5,"¢",null,{"$f":"IF(I13=C14,G14,IF(I13=C15,G15,IF(I13=C16,G16,IF(I13=C17,G17,IF(I13=C18,G18,IF(I13=C19,G19,))))))","v":0},{"$f":"J13*F13","v":0}]
[null,null,"1.      Designated affordable units, on average, are at or above 80% of the Median Market Rent",null,null,null,0]
[null,null,"2.      Designated affordable units, on average, are within 70 - 79% of the Median Market Rent",null,null,null,1]
[null,null,"3.      Designated affordable units, on average, are within 60 - 69% of the Median Market Rent",null,null,null,2]
[null,null,"4.      Designated affordable units, on average, are within 50 - 59% of the Median Market Rent",null,null,null,3]
[null,null,"5.      Designated affordable units, on average, are below 50% of the Median Market Rent",null,null,null,5]
[]
[null,"Accessibility",null,null,null,15,{"$f":"G21","v":5},null,null,{"$f":"J21","v":0},{"$f":"K21","v":0},{"$f":"K20/(F20*G20)","v":0}]
[null,"What percentage of units meet accessibility standards",null,null,null,15,5,"¢",null,{"$f":"IF(I21=C22,G22,IF(I21=C23,G23,IF(I21=C24,G24,IF(I21=C25,G25,IF(I21=C26,G26,)))))","v":0},{"$f":"J21*F21","v":0}]
[null,null,"1. Barrier free common areas and 20% of units meet accessibility standards ",null,null,null,0]
[null,null,"2. Barrier free common areas and 21-25% of units meet accessibility standards",null,null,null,1]
[null,null,"3. Barrier free common areas and 26-30% of units meet accessibility standards ",null,null,null,3]
[null,null,"4. Barrier free common areas and 31%+ of units meet accessibility standards ",null,null,null,5]
[]
[null,"Environmental Efficiency",null,null,null,15,{"$f":"G28","v":5},null,null,{"$f":"J28","v":0},{"$f":"K28","v":0},{"$f":"K27/(F28*G28)","v":0}]
[null,"What percentage reduction in operating energy consumption and greenhouse gas emissions will your project achieve?",null,null,null,15,5,"¢",null,{"$f":"IF(I28=C29,G29,IF(I28=C30,G30,IF(I28=C31,G31,IF(I28=C32,G32,))))","v":0},{"$f":"J28*F28","v":0}]
[null,null,"1.  Up to 25% reduction in operating energy consumption and greenhouse gas emissions",null,null,null,0]
[null,null,"2.  26 - 40% reduction in operating energy consumption and greenhouse gas emissions",null,null,null,1]
{"$rows_left_out":123}
{"sheet":"Rents & Affordability","index":2,"n_rows":50,"n_cols":26,"rows_kept":50,"cut":false,"hidden":false,"merged":[[6,12,6,13],[17,12,17,13],[5,12,5,13],[2,0,2,16]]}
["Note: Only YELLOW hi-lighted fields that are applicable need to be input. "]
[]
["Rents & Affordability: Repair and Renewal"]
[null,null,null,null,null,null,null,null,null,null,null,null,"To obtain data on Median Market rents (MMR) for your area, ",null,null,null,null,null,null,"Affordable Rent Ranges as percentage of MMR "]
[null,"Proforma Rents - Residential",null,"Determining Rent (incl. attached ancilliary component) Levels:",null,null,null,null,null,null,null,null,"please use the following link:"]
[null,null,null,"1) For units to be deemed \"Affordable\", rent must be below 80% of Median Market Rent for unit type",null,null,null,null,null,null,null,null,"HOUSING MARKET INFORMATION PORTAL"]
[null,"Province",null,"2) Remainder of units to be included as \"Market\"",null,null,null,null,null,null,null,null,"Test 1"]
[null,"City",null,"3) Input average rent for each unit type under Monthly Market Rent",null,null,null,null,null,null,null,null,"30% of units with "]
[null,"Zone",null,"4) **Input average monthly operational funding allocation for each unit under Affordable Rent",null,null,null,null,null,null,null,null,"rents below 80% of "]
[null,null,null,null,null,null,null,null,null,null,null,null,"MMR",null,null,null,null,null,null,null,"70% to","60% to","50% to","Below"]
[null,null,null,null,null,null,null,null,"Monthly","Annual",null,null,{"$f":"Z37","v":0},"# Units below 80% of MMR",null,null,null,null,null,0.8,0.79,0.69,0.59,0.5]
[null,null,"Unit","Number","Monthly Market","Affordable ","Monthly Median ","Affordable Rent","Proforma","PGI Proforma",null,null,{"$f":"Z38","v":0},"% Units that meet Test",null,null,null,null,"Lower Limit",null,0.7,0.6,0.5]
[null,"Unit type","Size (sq ft)","of Units","Rent (PGI)","Rent (PGI)","Mkt Rent (MMR)","as % of MMR ","Rents ","Total","Comments",null,{"$f":"IF(M12>=30%, \"Yes\", \"No\")","v":"No"},"30% Condition met?",null,null,null,null,"Upper Limit",0.8,0.79990000000000006,0.69989999999999997,0.59989999999999999,0.5]
[13,"Bachelor - market",null,null,null,null,null,null,{"$f":"E14*D14","v":0},{"$f":"I14*12","v":0}]
[null,"Bachelor - affordable",null,null,null,null,null,{"$f":"IFERROR(F15/G15,0)","v":0},{"$f":"F15*D15","v":0},{"$f":"I15*12","v":0},null,null,"# of Affordable",{"$f":"M11","v":0},null,null,null,null,null,{"$f":"IF(H15=0,0,IF(H15<=$T$11,D15,0))","v":0},{"$f":"IF(H15=0,0,IF(AND(H15<=$U$13,H15>=$U$12),D15,0))","v":0},{"$f":"IF(H15=0,0,IF(AND(H15<=$V$13,H15>=$V$12),D15,0))","v":0},{"$f":"IF(H15=0,0,IF(AND(H15<=$W$13,H15>=$W$12),D15,0))","v":0},{"$f":"IF(H15=0,0,IF(H15<$X$13,D15,0))","v":0}]
[14,"1 bed (incl. 1 bed plus den) - market",null,null,null,null,null,null,{"$f":"E16*D16","v":0},{"$f":"I16*12","v":0},null,null,"# of Market ",{"$f":"D37-N15","v":0}]
[null,"1 bed (incl. 1 bed plus den) - affordable",null,null,null,null,null,{"$f":"IFERROR(F17/G17,0)","v":0},{"$f":"F17*D17","v":0},0,null,null,"Total",{"$f":"SUM(N15:N16)","v":0},null,null,null,null,null,{"$f":"IF(H17=0,0,IF(H17<=$T$11,D17,0))","v":0},{"$f":"IF(H17=0,0,IF(AND(H17<=$U$13,H17>=$U$12),D17,0))","v":0},{"$f":"IF(H17=0,0,IF(AND(H17<=$V$13,H17>=$V$12),D17,0))","v":0},{"$f":"IF(H17=0,0,IF(AND(H17<=$W$13,H17>=$W$12),D17,0))","v":0},{"$f":"IF(H17=0,0,IF(H17<$X$13,D17,0))","v":0}]
[16,"2 bed (incl. 2 bed plus den) - market",null,null,null,null,null,null,{"$f":"E18*D18","v":0},0,null,null,"Test 2"]
[null,"2 bed (incl. 2 bed plus den) - affordable",null,null,null,null,null,{"$f":"IFERROR(F19/G19,0)","v":0},{"$f":"F19*D19","v":0},0,null,null,"Average rental cost of affordable units as a % of Average MMR",null,null,null,null,null,null,{"$f":"IF(H19=0,0,IF(H19<=$T$11,D19,0))","v":0},{"$f":"IF(H19=0,0,IF(AND(H19<=$U$13,H19>=$U$12),D19,0))","v":0},{"$f":"IF(H19=0,0,IF(AND(H19<=$V$13,H19>=$V$12),D19,0))","v":0},{"$f":"IF(H19=0,0,IF(AND(H19<=$W$13,H19>=$W$12),D19,0))","v":0},{"$f":"IF(H19=0,0,IF(H19<$X$13,D19,0))","v":0}]
[18,"3 bed (incl. 3 bed plus den) - market",null,null,null,null,null,null,{"$f":"E20*D20","v":0},0,null,null,"Median Market rent (weighted avg.)",null,{"$f":"IF(OR(D24<>0,D26<>0),\"Not Applicable\",T42)","v":0}]
[null,"3 bed (incl. 3 bed plus den) - affordable",null,null,null,null,null,{"$f":"IFERROR(F21/G21,0)","v":0},{"$f":"F21*D21","v":0},0,null,null,"Subject (weighted avg of affordable rents)",null,{"$f":"IF(OR(D24<>0,D26<>0),\"Not Applicable\",V42)","v":0},null,null,null,null,{"$f":"IF(H21=0,0,IF(H21<=$T$11,D21,0))","v":0},{"$f":"IF(H21=0,0,IF(AND(H21<=$U$13,H21>=$U$12),D21,0))","v":0},{"$f":"IF(H21=0,0,IF(AND(H21<=$V$13,H21>=$V$12),D21,0))","v":0},{"$f":"IF(H21=0,0,IF(AND(H21<=$W$13,H21>=$W$12),D21,0))","v":0},{"$f":"IF(H21=0,0,IF(H21<$X$13,D21,0))","v":0}]
[null,"4 bed (incl. 4 bed plus den) - market",null,null,null,null,null,null,{"$f":"E22*D22","v":0},{"$f":"I22*12","v":0},null,null,"Average level of Affordability",null,{"$f":"IF(OR(D24<>0,D26<>0), 100%,IF(N15=0,0,O21/O20))","v":0}]
[null,"4 bed (incl. 4 bed plus den) - affordable",null,null,null,null,null,{"$f":"IFERROR(F23/G23,0)","v":0},{"$f":"F23*D23","v":0},0,null,null,null,null,null,null,null,null,null,{"$f":"IF(H23=0,0,IF(H23<=$T$11,D23,0))","v":0},{"$f":"IF(H23=0,0,IF(AND(H23<=$U$13,H23>=$U$12),D23,0))","v":0},{"$f":"IF(H23=0,0,IF(AND(H23<=$V$13,H23>=$V$12),D23,0))","v":0},{"$f":"IF(H23=0,0,IF(AND(H23<=$W$13,H23>=$W$12),D23,0))","v":0},{"$f":"IF(H23=0,0,IF(H23<$X$13,D23,0))","v":0}]
[null,"Single Room Occupancy Rooms**",null,null,null,null,null,{"$f":"IF(F24<>0,100%,0)","v":0},{"$f":"F24*D24","v":0},0,null,null,null,null,null,null,null,null,null,{"$f":"IF(H24=0,0,IF(H24<=$T$11,D24,0))","v":0},{"$f":"IF(H24=0,0,IF(AND(H24<=$U$13,H24>=$U$12),D24,0))","v":0},{"$f":"IF(H24=0,0,IF(AND(H24<=$V$13,H24>=$V$12),D24,0))","v":0},{"$f":"IF(H24=0,0,IF(AND(H24<=$W$13,H24>=$W$12),D24,0))","v":0},{"$f":"IF(H24=0,0,IF(H24<$X$13,D24,0))","v":0}]
[null,"Single Room Occupancy Rooms - With Rental Income",null,null,null,null,null,{"$f":"IF(F25<>0,100%,0)","v":0},{"$f":"F25*D25","v":0},{"$f":"I25*12","v":0},null,null,null,null,null,null,null,null,null,{"$f":"IF(H25=0,0,IF(H25<=$T$11,D25,0))","v":0},{"$f":"IF(H25=0,0,IF(AND(H25<=$U$13,H25>=$U$12),D25,0))","v":0},{"$f":"IF(H25=0,0,IF(AND(H25<=$V$13,H25>=$V$12),D25,0))","v":0},{"$f":"IF(H25=0,0,IF(AND(H25<=$W$13,H25>=$W$12),D25,0))","v":0},{"$f":"IF(H25=0,0,IF(H25<$X$13,D25,0))","v":0}]
[null,"Shelters, beds**",null,null,null,null,null,0,0,0,null,null,null,null,null,null,null,null,null,{"$f":"IF(H26=0,0,IF(H26<=$T$11,D26,0))","v":0},{"$f":"IF(H26=0,0,IF(AND(H26<=$U$13,H26>=$U$12),D26,0))","v":0},{"$f":"IF(H26=0,0,IF(AND(H26<=$V$13,H26>=$V$12),D26,0))","v":0},{"$f":"IF(H26=0,0,IF(AND(H26<=$W$13,H26>=$W$12),D26,0))","v":0},{"$f":"IF(H26=0,0,IF(H26<$X$13,D26,0))","v":0}]
[null,"Shelters, beds - With Rental Income",null,null,null,null,null,0,0,0,null,null,null,null,null,null,null,null,null,{"$f":"IF(H27=0,0,IF(H27<=$T$11,D27,0))","v":0},{"$f":"IF(H27=0,0,IF(AND(H27<=$U$13,H27>=$U$12),D27,0))","v":0},{"$f":"IF(H27=0,0,IF(AND(H27<=$V$13,H27>=$V$12),D27,0))","v":0},{"$f":"IF(H27=0,0,IF(AND(H27<=$W$13,H27>=$W$12),D27,0))","v":0},{"$f":"IF(H27=0,0,IF(H27<$X$13,D27,0))","v":0}]
[null,"Add - Additional Affordable Units"]
[null,null,null,null,null,null,null,{"$f":"IFERROR(F29/G29,0)","v":0},{"$f":"F29*D29","v":0},{"$f":"I29*12","v":0},null,null,null,null,null,null,null,null,null,{"$f":"IF(H29=0,0,IF(H29<=$T$11,D29,0))","v":0},{"$f":"IF(H29=0,0,IF(AND(H29<=$U$13,H29>=$U$12),D29,0))","v":0},{"$f":"IF(H29=0,0,IF(AND(H29<=$V$13,H29>=$V$12),D29,0))","v":0},{"$f":"IF(H29=0,0,IF(AND(H29<=$W$13,H29>=$W$12),D29,0))","v":0},{"$f":"IF(H29=0,0,IF(H29<$X$13,D29,0))","v":0}]
[null,null,null,null,null,null,null,{"$f":"IFERROR(F30/G30,0)","v":0},{"$f":"F30*D30","v":0},0,null,null,null,null,null,null,null,null,null,{"$f":"IF(H30=0,0,IF(H30<=$T$11,D30,0))","v":0},{"$f":"IF(H30=0,0,IF(AND(H30<=$U$13,H30>=$U$12),D30,0))","v":0},{"$f":"IF(H30=0,0,IF(AND(H30<=$V$13,H30>=$V$12),D30,0))","v":0},{"$f":"IF(H30=0,0,IF(AND(H30<=$W$13,H30>=$W$12),D30,0))","v":0},{"$f":"IF(H30=0,0,IF(H30<$X$13,D30,0))","v":0}]
{"$rows_left_out":21}
{"sheet":"Project Budget ","index":3,"n_rows":68,"n_cols":12,"rows_kept":68,"cut":false,"hidden":false,"merged":[[24,7,24,9],[55,4,55,5],[55,7,55,8],[53,2,53,3],[1,0,1,11],[41,1,45,10],[8,7,8,9],[51,2,51,3],[52,2,52,3],[52,4,52,10],[29,7,29,9],[30,7,30,9],[31,7,31,9],[25,7,25,9],[26,7,26,9],[27,7,27,9],[28,7,28,9],[21,7,21,9],[22,7,22,9],[23,7,23,9]]}
["Note: Only YELLOW hi-lighted fields that are applicable need to be input. "]
["Project Budget: Repair and Renewal"]
[null,"Total Project Budget Costs"]
[null,"Project Characteristics",null,null,null,null,null,"Residential\n(A)","Non-Residential\n(B)","Total \n(A + B)"]
[null,"Total sq feet (Gross Floor Area estimated)",null,null,{"$f":"J5","v":0},null,null,null,null,{"$f":"H5+I5","v":0}]
[null,"Proportion of total",null,null,{"$f":"IF(J5=0,0,J6)","v":0},null,null,{"$f":"IF(J5=0,0,H5/J5)","v":0},{"$f":"IF(J5=0,0,I5/J5)","v":0},{"$f":"SUM(H6:I6)","v":0}]
[null,"Number of Residential units",null,null,{"$f":"'Rents & Affordability'!D37","v":0}]
[]
[null,"1. Project budget",null,null,"Total Project Costs","Per unit",null,"Pro-Rata Project Costs",null,null,null,"Comments (If Any)"]
[null,"Land",null,null,null,{"$f":"IF($E$7=0,0,E10/$E$7)","v":0},null,{"$f":"E10*H$6","v":0},{"$f":"E10*I$6","v":0},{"$f":"SUM(H10:I10)","v":0}]
[null,"Hard costs",null,null,null,{"$f":"IF($E$7=0,0,E11/$E$7)","v":0},null,{"$f":"E11*H$6","v":0},0,0]
[null,"Soft costs",null,null,null,0,null,0,0,0]
[null,"Financing costs",null,null,null,0,null,0,0,0]
[null,"HST (Net of Rebate, if any)",null,null,null,0,null,0,0,0]
[null,"Contingency",null,null,null,0,null,0,0,0]
[null,"Other (describe)",null,null,null,0,null,0,0,0]
[null,"Other (describe)",null,null,null,{"$f":"IF($E$7=0,0,E17/$E$7)","v":0},null,{"$f":"E17*H$6","v":0},{"$f":"E17*I$6","v":0},{"$f":"SUM(H17:I17)","v":0}]
[null,"Other (describe)",null,null,null,0,null,0,0,0]
[null,"Other (describe)",null,null,null,0,null,0,0,0]
[null,"Total Budget (Uses) (C)",null,null,{"$f":"SUM(E10:E19)","v":0},0,null,{"$f":"SUM(H10:H19)","v":0},{"$f":"SUM(I10:I19)","v":0},0]
[]
[null,"Sources of Funding (Non-NHCF)",null,null,null,null,null,"Comments\n(If Any)"]
[null,"Other Debt Financing ",null,null,null,{"$f":"IF($E$7=0,0,E23/$E$7)","v":0}]
[null,"           Other Grants / Contributions ",null,null,null,{"$f":"IF($E$7=0,0,E24/$E$7)","v":0}]
[null,"Land Value Equity",null,null,null,0]
[null,"Owner cash equity",null,null,null,0]
[null,"Other (describe)",null,null,null,0]
[null,"Other (describe)",null,null,null,0]
[null,"Other (describe)",null,null,null,0]
[null,"Other (describe)",null,null,null,0]
{"$rows_left_out":39}
{"sheet":"Proforma - Residential","index":4,"n_rows":108,"n_cols":10,"rows_kept":108,"cut":false,"hidden":false,"merged":[[108,1,112,10],[88,8,88,9],[24,8,24,9],[23,8,23,9],[1,0,1,10]]}
["Note: Only YELLOW hi-lighted fields that are applicable need to be input. "]
["Proforma - Residential: Repair and Renewal"]
[null,"Residential New: Financial Viability Assessment"]
[]
[null,"Percentage of Project Costs - Residential ",{"$f":"'Project Budget '!H6","v":0}]
[null,"Number of Residential Units",{"$f":"'Rents & Affordability'!D37","v":0}]
[]
[null,"1. Project budget"]
[null,null,null,"Per Unit","New Rental","Comments \n(If Any)"]
[null,"Land",null,{"$f":"IF($C$6=0,0,E10/$C$6)","v":0},{"$f":"C$5*'Project Budget '!E10","v":0}]
[null,"Hard costs",null,{"$f":"IF($C$6=0,0,E11/$C$6)","v":0},{"$f":"C$5*'Project Budget '!E11","v":0}]
[null,"Soft costs",null,0,{"$f":"C$5*'Project Budget '!E12","v":0}]
[null,"Financing costs",null,0,{"$f":"C$5*'Project Budget '!E13","v":0}]
[null,"HST ",null,0,{"$f":"C$5*'Project Budget '!E14","v":0}]
[null,"Contingency",null,0,{"$f":"C$5*'Project Budget '!E15","v":0}]
[null,{"$f":"'Project Budget '!B16","v":"Other (describe)"},null,0,{"$f":"C$5*'Project Budget '!E16","v":0}]
[null,{"$f":"'Project Budget '!B17","v":"Other (describe)"},null,{"$f":"IF($C$6=0,0,E17/$C$6)","v":0},{"$f":"C$5*'Project Budget '!E17","v":0}]
[null,{"$f":"'Project Budget '!B18","v":"Other (describe)"},null,0,{"$f":"C$5*'Project Budget '!E18","v":0}]
[null,{"$f":"'Project Budget '!B19","v":"Other (describe)"},null,0,{"$f":"C$5*'Project Budget '!E19","v":0}]
[null,"Total Budget (Uses)",null,0,{"$f":"SUM(E10:E19)","v":0}]
[]
[null,"Maximum NHCF Eligible Funding",{"$f":"E20*('Project Budget '!C57)","v":0},"Pro-rata Cost * Max funding"]
[null,"NHCF Funding Required",{"$f":"'Project Budget '!F58+('Project Budget '!I58-'Proforma - Non-Residential'!G79)","v":0}]
[]
[null,"2. Income Analysis- Residential"]
[null,null,null,null,null,null,"Annual PGI Proforma",null,"Comments \n(If Any)"]
[null,"Potential Gross Income (Total rental income)",null,null,null,null,{"$f":"'Rents & Affordability'!J36","v":0}]
[null,"Vacancy rate /bad debt"]
[null,"Less: Vacancy rate /bad debt",null,null,null,null,{"$f":"G27*G28","v":0}]
[null,"Effective Residential Gross Income",null,null,null,null,{"$f":"G27-G29","v":0}]
{"$rows_left_out":79}
{"sheet":"Proforma - Non-Residential","index":5,"n_rows":86,"n_cols":8,"rows_kept":86,"cut":false,"hidden":false,"merged":[[86,1,90,10],[21,3,22,5],[1,0,1,10]]}
["Note: Only YELLOW hi-lighted fields that are applicable need to be input. "]
["Proforma - Non-Residential: Repair and Renewal"]
[null,"Non-Residential : Financial Viability Assessment"]
[null,null,null,null,"Check"]
[null,"Percentage of Project Costs for Non-Residential ",null,{"$f":"'Project Budget '!I6","v":0},{"$f":"E6","v":"Yes"},"  (Non-Residential portion of project costs cannot exceed 30% of project costs)"]
[null,"Percentage of Project Floor Space for Non-Residential ",null,{"$f":"IFERROR('Project Budget '!I5/'Project Budget '!E5,0)","v":0},{"$f":"IF(D6<=30%,\"Yes\",\"No\")","v":"Yes"},"  (Non-Residential portion of floor space cannot exceed 30% of project space)"]
[]
[null,"1. Project budget - Non-Residential portion"]
[null,null,null,"Comments \n(If Any)"]
[null,"Land",{"$f":"D$5*'Project Budget '!E10","v":0}]
[null,"Hard costs",{"$f":"D$5*'Project Budget '!E11","v":0}]
[null,"Soft costs",{"$f":"D$5*'Project Budget '!E12","v":0}]
[null,"Financing costs",{"$f":"D$5*'Project Budget '!E13","v":0}]
[null,"HST ",{"$f":"D$5*'Project Budget '!E14","v":0}]
[null,"Misc. and Buffer",{"$f":"D$5*'Project Budget '!E15","v":0}]
[null,{"$f":"'Project Budget '!B16","v":"Other (describe)"},{"$f":"D$5*'Project Budget '!E16","v":0}]
[null,{"$f":"'Project Budget '!B17","v":"Other (describe)"},{"$f":"D$5*'Project Budget '!E17","v":0}]
[null,{"$f":"'Project Budget '!B18","v":"Other (describe)"},{"$f":"D$5*'Project Budget '!E18","v":0}]
[null,{"$f":"'Project Budget '!B19","v":"Other (describe)"},{"$f":"D$5*'Project Budget '!E19","v":0}]
[null,"Total Budget (Uses)",{"$f":"SUM(C10:C19)","v":0}]
[]
[null,"Maximum Loan Amount at 75% of costs ",{"$f":"MIN((C20*75%),'Project Budget '!I57)","v":0},"Note: This is applicable only if NHCF Loan is requested"]
[null,"Loan Still Required",{"$f":"'Project Budget '!I58","v":0}]
[]
[null,"2. Non-Residential / Commercial"]
[null,null,null,"Size (sf)","# Units","Monthly Rent","Annual ","Comments \n(If Any)"]
[null,"Retail/Office 1",null,null,null,null,{"$f":"E27*F27*12","v":0}]
[null,"Retail/Office 2",null,null,null,null,{"$f":"E28*F28*12","v":0}]
[null,"Retail/Office 3",null,null,null,null,{"$f":"E29*F29*12","v":0}]
[null,"Retail/Office 4",null,null,null,null,{"$f":"E30*F30*12","v":0}]
{"$rows_left_out":57}
{"sheet":"Drawdown Schedule ","index":6,"n_rows":42,"n_cols":10,"rows_kept":42,"cut":false,"hidden":false,"merged":[[10,1,10,4],[10,6,10,9],[42,1,45,9],[1,0,1,10]]}
["Note: Only YELLOW hi-lighted fields that are applicable need to be input. "]
["Drawdown Schedule: Repair and Renewal"]
["Drawdown Schedule"]
[]
["Type of Funding",{"$f":"IF('Project Budget '!$C$53=0,\"-\",'Project Budget '!$C$53)","v":"-"}]
["NHCF Funding Recommended",{"$f":"'Project Budget '!D59","v":0}]
["NHCF Forgivable Loan Recommended",{"$f":"'Project Budget '!E35","v":0}]
[]
[]
[]
[null,"REPAYABLE LOAN",null,null,null,null,"FORGIVABLE LOAN"]
[null,"Year","Drawdown Date","Drawdown Amount","Available Repayable  Loan Balance",null,"Year","Drawdown Date","Drawdown Amount","Available Forgivable Loan Balance"]
[null,null,null,null,{"$f":"IF(B5=\"Loan\",B6-D13,\"Not Applicable\")","v":"Not Applicable"},null,null,null,null,{"$f":"IF(B5=\"Contribution\",(B6+B7)-I13,B7-I13)","v":0}]
[null,null,null,null,{"$f":"IF(D14>0,E13-D14,\" \")","v":" "},null,null,null,null,{"$f":"IF(I14>0,J13-I14,\" \")","v":" "}]
[null,null,null,null,{"$f":"IF(D15>0,E14-D15,\" \")","v":" "},null,null,null,null,{"$f":"IF(I15>0,J14-I15,\" \")","v":" "}]
[null,null,null,null," ",null,null,null,null," "]
[null,null,null,null," ",null,null,null,null," "]
[null,null,null,null," ",null,null,null,null," "]
[null,"Total",null,{"$f":"SUM(D13:D18)","v":0},{"$f":"B6-D19","v":0},null,"Total",null,{"$f":"SUM(I13:I18)","v":0},{"$f":"J13+I13-I19","v":0}]
[null,null,null,null," ",null,null,null,null,{"$f":"IF(I20>0,J19-I20,\" \")","v":" "}]
[null,null,null,null," ",null,null,null,null," "]
[null,null,null,null," ",null,null,null,null," "]
[null,null,null,null," ",null,null,null,null," "]
[null,null,null,null," ",null,null,null,null," "]
[null,null,null,null," ",null,null,null,null," "]
[null,"Total",null,{"$f":"SUM(D20:D25)","v":0},{"$f":"IF(D26>0,E19-D26,\"\")","v":""},null,"Total",null,{"$f":"SUM(I20:I25)","v":0},{"$f":"IF(I26>0,J19-I26,\"\")","v":""}]
[null,null,null,null," ",null,null,null,null,{"$f":"IF(I27>0,J26-I27,\" \")","v":" "}]
[null,null,null,null," ",null,null,null,null," "]
[null,null,null,null," ",null,null,null,null," "]
[null,null,null,null," ",null,null,null,null," "]
{"$rows_left_out":12}